{"text_format":"1","workbook":"xlsx","n_sheets":7,"sheets":["INSTRUCTIVO DE USO","DTA","Hoja1","OBLIGACIONES APLICABLES","Temp","Hoja2","Hoja3"],"not_rendered":{"charts":0,"images":3,"macros":1,"external_links":0,"defined_names":5,"comments":1,"pivot_tables":0},"unopened":[],"bounds":{"document_bytes":16777216,"sheet_cells":100000,"rows_first":2000,"rows_last":500,"rows_between":2000,"halvings":0,"cell_chars":16384,"cell_head_chars":4096},"cells_cut":0,"cells_raw":0,"read":"whole","date_system":"1900"}

{"sheet":"INSTRUCTIVO DE USO","index":0,"n_rows":8,"n_cols":3,"rows_kept":8,"cut":false,"hidden":false,"merged":[[0,0,0,1],[0,2,0,12],[2,0,2,12],[4,0,5,12],[7,0,8,12]]}
[null,null,"INSTRUCTIVO DE USO DEL INSTRUMENTO DE OBLIGACIONES MÍNIMAS "]
[]
["1. INTRODUCCIÓN\n\nLas Obligaciones Mínimas son un instrumento interno de la Autoridad Nacional de Licencias Ambientales – ANLA formulado con el fin de unificar criterios por parte de los profesionales que realizan la evaluación y seguimiento de proyectos, obras o actividades sujetos al trámite de licenciamiento ambiental, mediante la estandarización de obligaciones mínimas asociadas al acto administrativo a través del cual se otorga o modifica la licencia ambiental, se actualizan los planes de manejo ambiental y se imponen medidas adicionales, de tal manera que se asegure que en cada tipo de proyecto se impongan las mismas obligaciones estandarizadas bajo requerimientos legales y directrices institucionales, así como con condiciones unificadas y claramente definidas de modo, tiempo y lugar. No obstante lo anterior, se tuvo en cuenta el alcance del mismo para formular obligaciones mínimas que fueran útiles en los procesos de evaluación y seguimiento de los Dictámenes Técnicos Ambientales - DTA.\n\nEs importante resaltar que, este instrumento al ser interno facilita la labor de esta autoridad en la imposición de obligaciones mínimas en los procesos de evaluación y seguimiento (este último en los casos estrictamente aplicables), y en la verificación del cumplimiento de las mismas en el seguimiento. Sin embargo, al ser puesto a disposición de los usuarios servirá como herramienta de planeación de los proyectos, de tal manera que previo a la radicación de los estudios ambientales frente a esta autoridad, las obligaciones puedan ser incorporadas por los usuarios en la formulación de los Planes de Manejo Ambiental - PMA\n\nPor lo anterior, a continuación se realizan algunas precisiones a los solicitantes de DTA cuando estos deseen consultar y hacer uso de este instrumento durante el proceso de formulación de sus PMA."]
[]
["2. DEFINICIONES\n\nCondición de lugar: (dónde) lugares o puntos en los que debe desarrollarse la actividad según experticia del evaluador o según protocolos, guías, normativa en general, etc.\nCondición de modo: (cómo) descripción de las características o circunstancias en las que se deben realizar las actividades autorizadas, según protocolos, guías, normativa en general y aspectos administrativos que se definan.\nCondición de tiempo: (cuándo) periodicidad para la ejecución de monitoreos, tiempos de realización de actividades, tiempos de presentación de la información, etc.\nObligaciones mínimas: Describen las condiciones mínimas de modo, tiempo y lugar a través de las cuales la Autoridad Ambiental, se pronuncia a través del concepto técnico (DTA) sobre la evaluación integral de los estudios presentados para obtener el Registro Nacional de plaguicidas químicos de uso agrícola, con base en los requerimientos del Manual Técnico de la Decisión Andina. En razón a lo anterior, se clasifican las obligaciones mínimas, de conformidad con las características de las condiciones reglamentadas, de la siguiente manera: obligaciones asociadas a componentes y actividades, obligaciones asociadas a planes, obligaciones socioeconómicas, obligaciones generales y requisitos del acto administrativo. \nObligaciones asociadas a actividades: contiene obligaciones relacionadas con algunas actividades propias del proyecto, como gestión de residuos.\nObligaciones asociadas a Planes: contiene obligaciones relacionadas con la ejecución y cumplimiento del plan de gestión del riesgo.\nObligaciones sociales: contienen obligaciones relacionadas con temas de gestión social.\nObligaciones generales: agrupa diferentes aspectos relacionados con cumplimiento de parámetros normativos, presentación de información asociada a la gestion del plaguicida y demás condiciones generales a ser tenidas en cuenta por parte del beneficiario del DTA. La inclusión de este tipo de obligaciones, deberá realizarse en todos los DTA. En caso de que el solicitante de la licencia ambiental haga uso de este instrumento durante el proceso de formulación de su PMA, deberá tener en cuenta sólo aquellas que soliciten el levantamiento y presentación de información a través de los Informes de Cumplimiento Ambiental.\nRequisitos del acto administrativo: corresponde a aquellas obligaciones de la ANLA frente a cada DTA. La inclusión por parte de los profesionales jurídicos de este tipo de obligaciones deberá realizarse en todas los DTA. No tienen relación alguna con las fases de desarrollo del proyecto y no son objeto de seguimiento. Algunas de las obligaciones, contienen textos en rojo que deberán ser diligenciados directamente en el acto administrativo por el profesional jurídico, como: nombre del producto formulado, nombre de la empresa, etc. En caso de que el solicitante de la licencia ambiental haga uso de este instrumento durante el proceso de formulación de su PMA, no deberá tener en cuenta este tipo de obligaciones dada la naturaleza de las mismas."]
[]
[]
["3. DESARROLLO\n\nCada archivo contiene dos pestañas u hojas de cálculo. La primera pestaña, hace referencia al tipo de proyecto para el cual se estandarizaron obligaciones asociadas a permisos, autorizaciones y aspectos generales. Esta pestaña cuenta con un encabezado indicando el tipo de proyecto para el cual se estandarizaron obligaciones y con 3 secciones.\n\nLa SECCIÓN 1. PERMISOS, AUTORIZACIONES Y ASPECTOS GENERALES agrupa 5 subsecciones que son descritas a continuación:\n\nSubsección 1. ID (Columna A): corresponde a la numeración de las obligaciones, la cual se encuentra en orden consecutivo.\nSubsección 2. Temática (Columna B): corresponde a la temática abordada en cada uno de los grupos de obligaciones mínimas (obligaciones asociadas a componentes y actividades, obligaciones asociadas a planes, obligaciones socioeconómicas, obligaciones generales y requisitos del acto administrativo).\nSubsección 3. Aspecto a tratar (Columna C): comprende los elementos a los que hace referencia cada obligación, p.e: actualización del plan de contingencia, implementar acciones para garantizar franjas de seguridad en la aplicación del producto, transporte de plaguicidas, etc.\nSubsección 4. Aspecto a tratar (Columna D): permite seleccionar la aplicabilidad ( √ ) o no ( X ) de una obligación mediante un doble clic en la celda, según el contexto del proyecto que se esté evaluando, es decir, si se le otorga un determinado permiso, se le autoriza alguna obra o actividad o le aplica de acuerdo con los permisos y actividades desarrolladas por el proyecto.\nSubsección 5. Obligación (Columna E): conjunto de obligaciones mínimas establecidas para cada temática y aspecto a tratar.\n\nPor otra parte, la SECCIÓN 2. FASES DEL PROYECTO PARA EL CUMPLIMIENTO Y SEGUIMIENTO A OBLIGACIONES indica la fase en la cual deberán ejecutarse las acciones asociadas a una determinada obligación para el cumplimiento por parte del beneficiario del DTA y el seguimiento por parte de la Autoridad: 1) Fase de importación y/o comercialización.\n\nFinalmente, la SECCIÓN 3. TEMPORALIDAD establece si la obligación debe ser de cumplimiento permanente o temporal por parte de los beneficiarios del DTA.\n\nUna vez se revisen todas las obligaciones mínimas y se indique si aplican o no, los usuarios de este instrumento deberán dirigirse a la segunda pestaña denominada OBLIGACIONES APLICABLES para generar el listado final de obligaciones mínimas que pueden establecerse a cada proyecto. Para generar este listado, se deberá dar clic en el botón de “Actualizar Anexo”.\n\nLa aplicabilidad de las obligaciones en las diferentes fases del proyecto, así como su temporalidad deberá asociarse al final de cada obligación en el respectivo documento (Concepto Técnico y acto administratico para el caso de la Autoridad o PMA para el caso de los usuarios o solicitantes del DTA)."]
{"$rows_left_out":1}
{"sheet":"DTA","index":1,"n_rows":40,"n_cols":7,"rows_kept":40,"cut":false,"hidden":false,"merged":[[2,6,3,6],[0,6,1,6],[5,0,5,4],[0,0,4,1],[0,2,4,4],[0,5,1,5],[2,5,3,5]]}
[null,null,"          OBLIGACIONES MÍNIMAS PARA DICTÁMENES TÉCNICOS AMBIENTALES - DTA",null,null,"Fecha:","2022-08-10"]
[]
[null,null,null,null,null,"Versión:",2]
[]
[null,null,null,null,null,"Código:","EL-FO-38"]
["SECCIÓN 1. PERMISOS, AUTORIZACIONES Y ASPECTOS GENERALES",null,null,null,null,"SECCIÓN 2. FASE DEL PROYECTO PARA EL CUMPLIMIENTO Y SEGUIMIENTO A OBLIGACIONES","SECCIÓN 3, TEMPORALIDAD"]
["ID","Temática","Aspecto a tratar","Aplica (SI / NO)","Obligación","Importación y/o comercialización","Temporal  / \nPermanente"]
[1,"PLAN DE CONTINGENCIA","Entrega de los soportes de implementación del plan de contingencia",null,"El titular del presente Dictamen Técnico Ambiental - DTA, incluirá los soportes de la implementación de las acciones incluidas en Plan de contingencia de conformidad con el Decreto 2151 del 2017, o aquel que lo modifique, derogue o sustituya a través de los Informes de Cumplimiento Ambiental - ICA.","Aplica","Permanente"]
{"$rows_left_out":33}
{"sheet":"Hoja1","index":2,"n_rows":4,"n_cols":7,"rows_kept":4,"cut":false,"hidden":true,"merged":[[2,1,3,1],[2,2,3,2],[2,6,3,6],[2,3,2,5]]}
[]
[]
[null,"Nombre comercial de la formulación","Cultivos","Cantidad total comercializada",null,null,"Cantidad total del producto comercializada en el país / año"]
[null,null,null,"Departamento 1","Departamento 2","Departamento n"]

{"sheet":"OBLIGACIONES APLICABLES","index":3,"n_rows":35,"n_cols":5,"rows_kept":35,"cut":false,"hidden":false,"merged":[[0,1,0,4]]}
[null,"OBLIGACIONES MÍNIMAS APLICABLES AL PROYECTO EN EVALUACIÓN / SEGUIMIENTO\nNota: Usar el texto de esta hoja para construir el concepto técnico y acto administrativo (Copiar y pegar en cada documento \na construir)"]
["Aplica (si / no)","COMPONENTE","Obligación","Importación y/o comercialización","Temporalidad"]
[{"$f":"DTA!D8","v":0},{"$f":"DTA!B8","v":"PLAN DE CONTINGENCIA"},{"$f":"DTA!E8","v":"El titular del presente Dictamen Técnico Ambiental - DTA, incluirá los soportes de la implementación de las acciones incluidas en Plan de contingencia de conformidad con el Decreto 2151 del 2017, o aquel que lo modifique, derogue o sustituya a través de los Informes de Cumplimiento Ambiental - ICA."},{"$f":"DTA!F8","v":"Aplica"},{"$f":"DTA!G8","v":"Permanente"}]
[{"$f":"DTA!D9","v":0},{"$f":"DTA!B9","v":"PLAN DE CONTINGENCIA"},{"$f":"DTA!E9","v":"Presentar en los Informes de Cumplimiento Ambiental – ICA, la revisión y/o complemento del Plan de Contingencia siguiendo los lineamientos descritos en el Decreto 1081 del 2015 adicionado por el Decreto 2157 de 2017 en el Artículo 2.3.1.5.2.1.1, Numeral 3.1.2, Literal f y el Decreto 1076 de 2015 en el Artículo 2.2.2.3.5.1, Numeral 9 y el Artículo 2.2.2.3.9.3 o aquellos que los modifiquen, deroguen o sustituyan y en caso de no presentarse un ajuste en el documento, indicar las razones por las cuales no se realiza.\n\na) Ante nuevas exigencias o cambios en la legislación nacional referente al plan de contingencia, en los plazos establecidos en las mismas.\nb) Cuando se introduzcan cambios en los procesos que aumenten la probabilidad de ocurrencia de una contingencia ambiental y/o consecuencia de la materialización del riesgo.  \nc) Ante cambios en las valoraciones de los escenarios de riesgo presentes en el proyecto.\nd) Ante la ocurrencia de una contingencia que evidencie la necesidad de ajuste del plan.\ne) Ante evidencias producto del proceso de seguimiento y control efectuado por la Autoridad Ambiental Competente."},{"$f":"DTA!F9","v":"Aplica"},{"$f":"DTA!G9","v":"Permanente"}]
[{"$f":"DTA!D10","v":0},{"$f":"DTA!B10","v":"PLAN DE CONTINGENCIA"},{"$f":"DTA!E10","v":"Reportar los eventos de contingencia a través de la plataforma VITAL de conformidad a lo establecido en el artículo 2o. de la Resolución 1767 de 2016 o aquellos que los modifiquen, deroguen o sustituyan, ya sea que los eventos sean generados del proyecto hacia el medio o del medio hacia el proyecto, presentando en cada uno de los avances (reportes parciales, de recuperación ambiental y final, según corresponda), las medidas, monitoreos, protocolos y/o acciones ejecutadas en el marco de la atención."},{"$f":"DTA!F10","v":"Aplica"},{"$f":"DTA!G10","v":"Permanente"}]
[{"$f":"DTA!D11","v":0},{"$f":"DTA!B11","v":"RESIDUOS"},{"$f":"DTA!E11","v":"En caso de realizar movimientos transfronterizos para disposición de desechos peligrosos, el titular del presente Dictámen Técnico Ambiental deberá dar cumplimiento a lo dispuesto en el Convenio de Basilea, ratificado por la Ley 253 del 9 de enero de 1996, sobre el control de los movimientos transfronterizos de los desechos peligrosos y su eliminación, así como el Decreto 1076 de 2015 y demás normas reglamentarias."},{"$f":"DTA!F11","v":"Aplica"},{"$f":"DTA!G11","v":"Permanente"}]
[{"$f":"DTA!D12","v":0},{"$f":"DTA!B12","v":"RESIDUOS"},{"$f":"DTA!E12","v":"El titular del presente Dictamen Técnico Ambiental - DTA deberá incluir el producto formulado de que trata el Dictamen Técnico Ambiental emitido mediante el presente acto administrativo, en el Plan de Gestión de Devolución de Productos Posconsumo de Plaguicidas, de conformidad con lo establecido en la Resolución 1675 de 2 de diciembre de 2013 e informar sobre el número de radicado de entrega del plan a esta autoridad por cada periodo reportado en los respectivos Informes de Cumplimiento Ambiental - ICA."},{"$f":"DTA!F12","v":"Aplica"},{"$f":"DTA!G12","v":"Permanente"}]
[{"$f":"DTA!D13","v":0},{"$f":"DTA!B13","v":"OBLIGACIONES GENERALES "},{"$f":"DTA!E13","v":"Si en un periodo anual a partir de la fecha de obtención del Registro Nacional de Plaguicidas Químicos de Uso Agrícola, la empresa [nombre de la empresa] no realiza las actividades de importación o comercialización, deberá en el primer trimestre del año siguiente presentar ante esta Autoridad y por los medios legalmente establecidos el certificado del revisor fiscal o el representante legal de la empresa, mediante el cual se acredite la no realización de estas actividades."},{"$f":"DTA!F13","v":"Aplica"},{"$f":"DTA!G13","v":"Temporal"}]
{"$rows_left_out":28}
{"sheet":"Temp","index":4,"n_rows":170,"n_cols":4,"rows_kept":170,"cut":false,"hidden":true,"merged":[[0,0,0,3]]}
["ANEXO - OBLIGACIONES MÍNIMAS PARA [COLOCAR NOMBRE DEL PROYECTO]"]
["COMPONENTE","Fase de construcción","Fase de operación y mantenimiento","Fase de desmantelamiento y abandono"]
[{"$f":"IF(DTA!#REF!=\"SI\",DTA!#REF!,NA())","v":{"$error":"#REF!"}},{"$f":"IF(DTA!#REF!=\"SI\",DTA!#REF!,NA())","v":{"$error":"#REF!"}},{"$f":"IF(DTA!#REF!=\"SI\",DTA!#REF!,NA())","v":{"$error":"#REF!"}},{"$f":"IF(DTA!#REF!=\"SI\",'OBLIGACIONES APLICABLES'!#REF!,NA())","v":{"$error":"#REF!"}}]
[{"$f":"IF(DTA!#REF!=\"SI\",DTA!#REF!,NA())","v":{"$error":"#REF!"}},{"$f":"IF(DTA!#REF!=\"SI\",DTA!#REF!,NA())","v":{"$error":"#REF!"}},{"$f":"IF(DTA!#REF!=\"SI\",'OBLIGACIONES APLICABLES'!#REF!,NA())","v":{"$error":"#REF!"}},{"$f":"IF(DTA!#REF!=\"SI\",'OBLIGACIONES APLICABLES'!#REF!,NA())","v":{"$error":"#REF!"}}]
[{"$f":"IF(DTA!#REF!=\"SI\",DTA!#REF!,NA())","v":{"$error":"#REF!"}},{"$f":"IF(DTA!#REF!=\"SI\",DTA!#REF!,NA())","v":{"$error":"#REF!"}},{"$f":"IF(DTA!#REF!=\"SI\",'OBLIGACIONES APLICABLES'!#REF!,NA())","v":{"$error":"#REF!"}},{"$f":"IF(DTA!#REF!=\"SI\",'OBLIGACIONES APLICABLES'!#REF!,NA())","v":{"$error":"#REF!"}}]
[{"$f":"IF(DTA!#REF!=\"SI\",DTA!#REF!,NA())","v":{"$error":"#REF!"}},{"$f":"IF(DTA!#REF!=\"SI\",DTA!#REF!,NA())","v":{"$error":"#REF!"}},{"$f":"IF(DTA!#REF!=\"SI\",'OBLIGACIONES APLICABLES'!#REF!,NA())","v":{"$error":"#REF!"}},{"$f":"IF(DTA!#REF!=\"SI\",'OBLIGACIONES APLICABLES'!#REF!,NA())","v":{"$error":"#REF!"}}]
[{"$f":"IF(DTA!#REF!=\"SI\",DTA!#REF!,NA())","v":{"$error":"#REF!"}},{"$f":"IF(DTA!#REF!=\"SI\",DTA!#REF!,NA())","v":{"$error":"#REF!"}},{"$f":"IF(DTA!#REF!=\"SI\",'OBLIGACIONES APLICABLES'!#REF!,NA())","v":{"$error":"#REF!"}},{"$f":"IF(DTA!#REF!=\"SI\",'OBLIGACIONES APLICABLES'!#REF!,NA())","v":{"$error":"#REF!"}}]
[{"$f":"IF(DTA!#REF!=\"SI\",DTA!#REF!,NA())","v":{"$error":"#REF!"}},{"$f":"IF(DTA!#REF!=\"SI\",DTA!#REF!,NA())","v":{"$error":"#REF!"}},{"$f":"IF(DTA!#REF!=\"SI\",'OBLIGACIONES APLICABLES'!#REF!,NA())","v":{"$error":"#REF!"}},{"$f":"IF(DTA!#REF!=\"SI\",'OBLIGACIONES APLICABLES'!#REF!,NA())","v":{"$error":"#REF!"}}]
{"$rows_left_out":163}
{"sheet":"Hoja2","index":5,"n_rows":74,"n_cols":4,"rows_kept":74,"cut":false,"hidden":true,"merged":[]}
["COMPONENTE","Fase de construcción","Fase de operación y mantenimiento","Fase de desmantelamiento y abandono"]
[{"$f":"IFERROR(INDEX(Temp!A$3:A$170, SMALL(IF(ISERROR(Temp!A$3:A$170), \"\", ROW(Temp!A$3:A$170)-MIN(ROW(Temp!A$3:A$170))+1), ROW(1:1))),\"\")","v":""},{"$f":"IFERROR(INDEX(Temp!B$3:B$170, SMALL(IF(ISERROR(Temp!B$3:B$170), \"\", ROW(Temp!B$3:B$170)-MIN(ROW(Temp!B$3:B$170))+1), ROW(1:1))),\"\")","v":""},{"$f":"IFERROR(INDEX(Temp!C$3:C$170, SMALL(IF(ISERROR(Temp!C$3:C$170), \"\", ROW(Temp!C$3:C$170)-MIN(ROW(Temp!C$3:C$170))+1), ROW(1:1))),\"\")","v":""},{"$f":"IFERROR(INDEX(Temp!D$3:D$170, SMALL(IF(ISERROR(Temp!D$3:D$170), \"\", ROW(Temp!D$3:D$170)-MIN(ROW(Temp!D$3:D$170))+1), ROW(1:1))),\"\")","v":""}]
[{"$f":"IFERROR(INDEX(Temp!A$3:A$170, SMALL(IF(ISERROR(Temp!A$3:A$170), \"\", ROW(Temp!A$3:A$170)-MIN(ROW(Temp!A$3:A$170))+1), ROW(2:2))),\"\")","v":""},{"$f":"IFERROR(INDEX(Temp!B$3:B$170, SMALL(IF(ISERROR(Temp!B$3:B$170), \"\", ROW(Temp!B$3:B$170)-MIN(ROW(Temp!B$3:B$170))+1), ROW(2:2))),\"\")","v":""},{"$f":"IFERROR(INDEX(Temp!C$3:C$170, SMALL(IF(ISERROR(Temp!C$3:C$170), \"\", ROW(Temp!C$3:C$170)-MIN(ROW(Temp!C$3:C$170))+1), ROW(2:2))),\"\")","v":""},{"$f":"IFERROR(INDEX(Temp!D$3:D$170, SMALL(IF(ISERROR(Temp!D$3:D$170), \"\", ROW(Temp!D$3:D$170)-MIN(ROW(Temp!D$3:D$170))+1), ROW(2:2))),\"\")","v":""}]
[{"$f":"IFERROR(INDEX(Temp!A$3:A$170, SMALL(IF(ISERROR(Temp!A$3:A$170), \"\", ROW(Temp!A$3:A$170)-MIN(ROW(Temp!A$3:A$170))+1), ROW(3:3))),\"\")","v":""},{"$f":"IFERROR(INDEX(Temp!B$3:B$170, SMALL(IF(ISERROR(Temp!B$3:B$170), \"\", ROW(Temp!B$3:B$170)-MIN(ROW(Temp!B$3:B$170))+1), ROW(3:3))),\"\")","v":""},{"$f":"IFERROR(INDEX(Temp!C$3:C$170, SMALL(IF(ISERROR(Temp!C$3:C$170), \"\", ROW(Temp!C$3:C$170)-MIN(ROW(Temp!C$3:C$170))+1), ROW(3:3))),\"\")","v":""},{"$f":"IFERROR(INDEX(Temp!D$3:D$170, SMALL(IF(ISERROR(Temp!D$3:D$170), \"\", ROW(Temp!D$3:D$170)-MIN(ROW(Temp!D$3:D$170))+1), ROW(3:3))),\"\")","v":""}]
[{"$f":"IFERROR(INDEX(Temp!A$3:A$170, SMALL(IF(ISERROR(Temp!A$3:A$170), \"\", ROW(Temp!A$3:A$170)-MIN(ROW(Temp!A$3:A$170))+1), ROW(4:4))),\"\")","v":""},{"$f":"IFERROR(INDEX(Temp!B$3:B$170, SMALL(IF(ISERROR(Temp!B$3:B$170), \"\", ROW(Temp!B$3:B$170)-MIN(ROW(Temp!B$3:B$170))+1), ROW(4:4))),\"\")","v":""},{"$f":"IFERROR(INDEX(Temp!C$3:C$170, SMALL(IF(ISERROR(Temp!C$3:C$170), \"\", ROW(Temp!C$3:C$170)-MIN(ROW(Temp!C$3:C$170))+1), ROW(4:4))),\"\")","v":""},{"$f":"IFERROR(INDEX(Temp!D$3:D$170, SMALL(IF(ISERROR(Temp!D$3:D$170), \"\", ROW(Temp!D$3:D$170)-MIN(ROW(Temp!D$3:D$170))+1), ROW(4:4))),\"\")","v":""}]
[{"$f":"IFERROR(INDEX(Temp!A$3:A$170, SMALL(IF(ISERROR(Temp!A$3:A$170), \"\", ROW(Temp!A$3:A$170)-MIN(ROW(Temp!A$3:A$170))+1), ROW(5:5))),\"\")","v":""},{"$f":"IFERROR(INDEX(Temp!B$3:B$170, SMALL(IF(ISERROR(Temp!B$3:B$170), \"\", ROW(Temp!B$3:B$170)-MIN(ROW(Temp!B$3:B$170))+1), ROW(5:5))),\"\")","v":""},{"$f":"IFERROR(INDEX(Temp!C$3:C$170, SMALL(IF(ISERROR(Temp!C$3:C$170), \"\", ROW(Temp!C$3:C$170)-MIN(ROW(Temp!C$3:C$170))+1), ROW(5:5))),\"\")","v":""},{"$f":"IFERROR(INDEX(Temp!D$3:D$170, SMALL(IF(ISERROR(Temp!D$3:D$170), \"\", ROW(Temp!D$3:D$170)-MIN(ROW(Temp!D$3:D$170))+1), ROW(5:5))),\"\")","v":""}]
[{"$f":"IFERROR(INDEX(Temp!A$3:A$170, SMALL(IF(ISERROR(Temp!A$3:A$170), \"\", ROW(Temp!A$3:A$170)-MIN(ROW(Temp!A$3:A$170))+1), ROW(6:6))),\"\")","v":""},{"$f":"IFERROR(INDEX(Temp!B$3:B$170, SMALL(IF(ISERROR(Temp!B$3:B$170), \"\", ROW(Temp!B$3:B$170)-MIN(ROW(Temp!B$3:B$170))+1), ROW(6:6))),\"\")","v":""},{"$f":"IFERROR(INDEX(Temp!C$3:C$170, SMALL(IF(ISERROR(Temp!C$3:C$170), \"\", ROW(Temp!C$3:C$170)-MIN(ROW(Temp!C$3:C$170))+1), ROW(6:6))),\"\")","v":""},{"$f":"IFERROR(INDEX(Temp!D$3:D$170, SMALL(IF(ISERROR(Temp!D$3:D$170), \"\", ROW(Temp!D$3:D$170)-MIN(ROW(Temp!D$3:D$170))+1), ROW(6:6))),\"\")","v":""}]
[{"$f":"IFERROR(INDEX(Temp!A$3:A$170, SMALL(IF(ISERROR(Temp!A$3:A$170), \"\", ROW(Temp!A$3:A$170)-MIN(ROW(Temp!A$3:A$170))+1), ROW(7:7))),\"\")","v":""},{"$f":"IFERROR(INDEX(Temp!B$3:B$170, SMALL(IF(ISERROR(Temp!B$3:B$170), \"\", ROW(Temp!B$3:B$170)-MIN(ROW(Temp!B$3:B$170))+1), ROW(7:7))),\"\")","v":""},{"$f":"IFERROR(INDEX(Temp!C$3:C$170, SMALL(IF(ISERROR(Temp!C$3:C$170), \"\", ROW(Temp!C$3:C$170)-MIN(ROW(Temp!C$3:C$170))+1), ROW(7:7))),\"\")","v":""},{"$f":"IFERROR(INDEX(Temp!D$3:D$170, SMALL(IF(ISERROR(Temp!D$3:D$170), \"\", ROW(Temp!D$3:D$170)-MIN(ROW(Temp!D$3:D$170))+1), ROW(7:7))),\"\")","v":""}]
{"$rows_left_out":67}
{"sheet":"Hoja3","index":6,"n_rows":0,"n_cols":0,"rows_kept":0,"cut":false,"hidden":true,"merged":[]}