{"text_format":"1","workbook":"xlsx","n_sheets":5,"sheets":["INSTRUCTIVO DE USO","INTRODUCCIÓN ESPECIES FASE INV","OBLIGACIONES APLICABLES","Temp","Hoja2"],"not_rendered":{"charts":0,"images":2,"macros":1,"external_links":0,"defined_names":5,"comments":1,"pivot_tables":0},"unopened":[],"bounds":{"document_bytes":16777216,"sheet_cells":100000,"rows_first":2000,"rows_last":500,"rows_between":2000,"halvings":0,"cell_chars":16384,"cell_head_chars":4096},"cells_cut":0,"cells_raw":0,"read":"whole","date_system":"1900"}

{"sheet":"INSTRUCTIVO DE USO","index":0,"n_rows":11,"n_cols":3,"rows_kept":11,"cut":false,"hidden":false,"merged":[[10,0,10,12],[0,0,0,1],[0,2,0,12],[2,0,2,12],[4,0,5,12],[7,0,8,12]]}
[null,null,"INSTRUCTIVO DE USO DEL INSTRUMENTO DE OBLIGACIONES MÍNIMAS "]
[]
["1. INTRODUCCIÓN\n\nLas Obligaciones Mínimas son un instrumento interno de la Autoridad Nacional de Licencias Ambientales – ANLA formulado con el fin de unificar criterios por parte de los profesionales que realizan la evaluación y seguimiento de proyectos, obras o actividades sujetos al trámite de licenciamiento ambiental, mediante la estandarización de obligaciones mínimas asociadas al acto administrativo a través del cual se otorga o modifica la licencia ambiental, se actualizan los planes de manejo ambiental y se imponen medidas adicionales, de tal manera que se asegure que en cada tipo de proyecto se impongan las mismas obligaciones estandarizadas bajo requerimientos legales y directrices institucionales, así como con condiciones unificadas y claramente definidas de modo, tiempo y lugar.\n\nEs importante resaltar que, este instrumento al ser interno facilita la labor de esta autoridad en la imposición de obligaciones mínimas en los procesos de evaluación y seguimiento (este último en los casos estrictamente aplicables), y en la verificación del cumplimiento de las mismas en el seguimiento. Sin embargo, al ser puesto a disposición de los usuarios o solicitantes de licencias ambientales servirá como herramienta de planeación de los proyectos, obras o actividades sujetos a licenciamiento, de tal manera que previo a la radicación de los estudios ambientales frente a esta autoridad, las obligaciones puedan ser incorporadas por los usuarios en la formulación de los Planes de Manejo Ambiental - PMA\n\nPor lo anterior, a continuación se realizan algunas precisiones a los solicitantes de licencias ambientales cuando estos deseen consultar y hacer uso de este instrumento durante el proceso de formulación de sus PMA."]
[]
["2. DEFINICIONES\n\nCondición de lugar: (dónde) lugares o puntos en los que debe desarrollarse la actividad según experticia del evaluador o según protocolos, guías, normativa en general, etc.\nCondición de modo: (cómo) descripción de las características o circunstancias en las que se deben realizar las actividades autorizadas, según protocolos, guías, normativa en general y aspectos administrativos que se definan.\nCondición de tiempo: (cuándo) periodicidad para la ejecución de monitoreos, tiempos de realización de actividades, tiempos de presentación de la información, etc.\nObligaciones mínimas: Describen las condiciones mínimas de modo, tiempo y lugar a través de las cuales la Autoridad Ambiental, autoriza la ejecución de un proyecto, obra o actividad sujeto legalmente al trámite de Licenciamiento Ambiental, identificando los permisos, autorizaciones y/o concesiones cuando sea el caso, de conformidad con cada subsector (tipo de proyecto). En razón a lo anterior, se clasifican las obligaciones mínimas, de conformidad con las características de las condiciones reglamentadas, de la siguiente manera: obligaciones asociadas a componentes y actividades, obligaciones asociadas a planes, obligaciones socioeconómicas, obligaciones generales y requisitos del acto administrativo. \nObligaciones asociadas a componentes y actividades: contiene obligaciones relacionadas con algunos componentes y actividades propias del proyecto, obra o actividad, tales como: características de los sitios de almacenamiento temporal de la especie importada e infraestructura asociada, gestión de residuos, entre otras.\nObligaciones asociadas a Planes: contiene obligaciones relacionadas con la ejecución y cumplimiento del plan de gestión del riesgo y plan de desmantelamiento y abandono.\nObligaciones socioeconómicas: contienen obligaciones relacionadas con temas, tales como: gestión social y valoración económica.\nObligaciones generales: agrupa diferentes aspectos relacionados con cumplimiento de parámetros normativos, presentación de información asociada a la especie importada y a la fase de experimentación y demás condiciones generales a ser tenidas en cuenta por parte del titular de la licencia. La inclusión de este tipo de obligaciones, deberá realizarse en todas las licencias ambientales, sin importar el tipo de proyecto. En caso de que el solicitante de la licencia ambiental haga uso de este instrumento durante el proceso de formulación de su PMA, deberá tener en cuenta sólo aquellas que soliciten el levantamiento y presentación de información a través de los Informes de Cumplimiento Ambiental.\nRequisitos del acto administrativo: corresponde a aquellas obligaciones de la ANLA frente a cada licencia ambiental. La inclusión por parte de los profesionales jurídicos de este tipo de obligaciones deberá realizarse en todas las licencias ambientales, sin importar el tipo de proyecto. No tienen relación alguna con las fases de desarrollo del proyecto y no son objeto de seguimiento. Algunas de las obligaciones, contienen textos en rojo que deberán ser diligenciados directamente en el acto administrativo por el profesional jurídico, como: nombre y NIT del titular del proyecto. En caso de que el solicitante de la licencia ambiental haga uso de este instrumento durante el proceso de formulación de su PMA, no deberá tenerl en cuenta este tipo de obligaciones dada la naturaleza de las mismas."]
[]
[]
["3. DESARROLLO\n\nEste instrumento representa una estandarización mínima a la luz de las necesidades de cada sector y tipos de proyectos, obras o actividades en todas las regiones, por lo cual, tanto los profesionales de la Autoridad como los usuarios o solicitantes de licencias ambientales, con fundamento en el conocimiento de las condiciones ambientales propias del área (hídricas, climáticas, geomorfológicas, de suelos, etc.) y de las actividades a desarrollar por parte del proyecto, deberán hacer uso de las obligaciones específicas a que haya lugar y en los casos estrictamente necesarios y técnicamente justificados se podrán adaptar aquellas obligaciones mínimas que así lo requieran. \n\nCada archivo contiene dos pestañas u hojas de cálculo. La primera pestaña, hace referencia al tipo de proyecto para el cual se estandarizaron obligaciones asociadas a permisos, autorizaciones y aspectos generales. Esta pestaña cuenta con un encabezado indicando el tipo de proyecto para el cual se estandarizaron obligaciones y con 3 secciones.\n\nLa SECCIÓN 1. PERMISOS, AUTORIZACIONES Y ASPECTOS GENERALES agrupa 5 subsecciones que son descritas a continuación:\n\nSubsección 1. ID (Columna A): corresponde a la numeración de las obligaciones, la cual se encuentra en orden consecutivo.\nSubsección 2. Temática (Columna B): corresponde a la temática abordada en cada uno de los grupos de obligaciones mínimas (obligaciones de uso, aprovechamiento y/o afectación de recursos naturales, obligaciones asociadas a componentes y actividades, obligaciones asociadas a planes, obligaciones socioeconómicas, obligaciones generales y requisitos del acto administrativo).\nSubsección 3. Aspecto a tratar (Columna C): comprende los elementos a los que hace referencia cada obligación, p.e: salvoconducto para la movilización de la especie introducida, protocolo de manejo / seguridad ambiental, presentación del permiso (NO CITES) y VUCE, etc.\nSubsección 4. Aspecto a tratar (Columna D): permite seleccionar la aplicabilidad ( √ ) o no ( X ) de una obligación mediante un doble clic en la celda, según el contexto del proyecto que se esté evaluando, es decir, si se le otorga un determinado permiso, se le autoriza alguna obra o actividad o le aplica de acuerdo con los permisos y actividades desarrolladas por le proyecto.\nSubsección 5. Obligación (Columna E): conjunto de obligaciones mínimas establecidas para cada temática y aspecto a tratar.\n\nPor otra parte, la SECCIÓN 2. FASES DEL PROYECTO PARA EL CUMPLIMIENTO Y SEGUIMIENTO A OBLIGACIONES indica la fase en la cual deberán ejecutarse las acciones asociadas a una determinada obligación para el cumplimiento por parte del titular de la licencia y el seguimiento por parte de la Autoridad: 1) Etapa de importación y 2) Etapa de experimentación. \n\nFinalmente, la SECCIÓN 3. TEMPORALIDAD establece si la obligación debe ser de cumplimiento permanente o temporal por parte de los titulares de las licencias.\n\nUna vez se revisen todas las obligaciones mínimas y se indique si aplican o no, los usuarios de este instrumento deberán dirigirse a la segunda pestaña denominada OBLIGACIONES APLICABLES para generar el listado final de obligaciones mínimas que pueden establecerse a cada proyecto. Para generar este listado, se deberá dar clic en el botón de “Actualizar Anexo”.\n\nLa aplicabilidad de las obligaciones en las diferentes fases del proyecto, así como su temporalidad deberá asociarse al final de cada obligación en el respectivo documento (Concepto Técnico y acto administratico para el caso de la Autoridad o PMA para el caso de los usuarios o solicitantes de licencias ambientales)."]
{"$rows_left_out":4}
{"sheet":"INTRODUCCIÓN ESPECIES FASE INV","index":1,"n_rows":66,"n_cols":8,"rows_kept":66,"cut":false,"hidden":false,"merged":[[5,8,5,23],[5,0,5,4],[0,0,4,1],[0,2,4,4],[0,5,1,5],[2,5,3,5],[0,6,1,7],[2,6,3,7],[4,6,4,7],[5,5,5,6]]}
[null,null,"          OBLIGACIONES MÍNIMAS PARA PROYECTOS DE INTRODUCCIÓN DE PARENTALES, ESPECIES, SUBESPECIES, RAZAS, HÍBRIDOS O VARIEDADES FORÁNEAS",null,null,"Fecha:","2022-08-10"]
[]
[null,null,null,null,null,"Versión:",2]
[]
[null,null,null,null,null,"Código:","EL-FO-39"]
["SECCIÓN 1. PERMISOS, AUTORIZACIONES Y ASPECTOS GENERALES",null,null,null,null,"SECCIÓN 2. FASE DEL PROYECTO PARA EL CUMPLIMIENTO Y SEGUIMIENTO A OBLIGACIONES",null,"SECCIÓN 3. TEMPORALIDAD"]
["ID","Temática","Aspecto a tratar","Aplica (SI / NO)","Obligación","Etapa de importación","Etapa de experimentación","Temporal  / \nPermanente"]
[1,"OBLIGACIÓN GENERAL","Prohibición de la comercialización previo a la finalización de la fase de investigación o experimental",null,"El titular de la licencia ambiental no podrá adelantar actividades de comercialización de parentales, especies, subespecies, razas, híbridos o variedades foráneas, ni con su progenie, hasta tanto se supere la fase de investigación o experimental, se haya dado cumplimiento a las obligaciones establecidas por acto administrativo para esta fase y se haya surtido la modificación de la licencia ambiental.","Aplica","Aplica","Permanente"]
{"$rows_left_out":59}
{"sheet":"OBLIGACIONES APLICABLES","index":2,"n_rows":61,"n_cols":6,"rows_kept":61,"cut":false,"hidden":false,"merged":[[0,1,0,5]]}
[null,"OBLIGACIONES MÍNIMAS APLICABLES AL PROYECTO EN EVALUACIÓN / SEGUIMIENTO\nNota: Usar el texto de esta hoja para construir el concepto técnico y acto administrativo (Copiar y pegar en cada documento a construir)"]
["Aplica (si / no)","COMPONENTE","Obligación","Etapa de importación","Etapa de experimentación","Temporalidad"]
[{"$f":"'INTRODUCCIÓN ESPECIES FASE INV'!D8","v":0},{"$f":"'INTRODUCCIÓN ESPECIES FASE INV'!B8","v":"OBLIGACIÓN GENERAL"},{"$f":"'INTRODUCCIÓN ESPECIES FASE INV'!E8","v":"El titular de la licencia ambiental no podrá adelantar actividades de comercialización de parentales, especies, subespecies, razas, híbridos o variedades foráneas, ni con su progenie, hasta tanto se supere la fase de investigación o experimental, se haya dado cumplimiento a las obligaciones establecidas por acto administrativo para esta fase y se haya surtido la modificación de la licencia ambiental."},{"$f":"'INTRODUCCIÓN ESPECIES FASE INV'!F8","v":"Aplica"},{"$f":"'INTRODUCCIÓN ESPECIES FASE INV'!G8","v":"Aplica"},{"$f":"'INTRODUCCIÓN ESPECIES FASE INV'!H8","v":"Permanente"}]
[{"$f":"'INTRODUCCIÓN ESPECIES FASE INV'!D9","v":0},{"$f":"'INTRODUCCIÓN ESPECIES FASE INV'!B9","v":"OBLIGACIÓN GENERAL"},{"$f":"'INTRODUCCIÓN ESPECIES FASE INV'!E9","v":"El titular de la licencia ambiental no podrá movilizar los parentales, especies, subespecies, razas, híbridos o variedades foráneas objeto de introducción o su progenie a ninguna instalación diferente a la autorizada en la Licencia Ambiental, desde su llegada hasta el sitio donde se desarrollará la fase de investigación o experimental, o desde donde se desarrollará la fase de investigación o experimental a cualquier otra locación. "},{"$f":"'INTRODUCCIÓN ESPECIES FASE INV'!F9","v":"Aplica"},{"$f":"'INTRODUCCIÓN ESPECIES FASE INV'!G9","v":"Aplica"},{"$f":"'INTRODUCCIÓN ESPECIES FASE INV'!H9","v":"Permanente"}]
[{"$f":"'INTRODUCCIÓN ESPECIES FASE INV'!D10","v":0},{"$f":"'INTRODUCCIÓN ESPECIES FASE INV'!B10","v":"OBLIGACIÓN GENERAL"},{"$f":"'INTRODUCCIÓN ESPECIES FASE INV'!E10","v":"Previo a la introducción, el titular de la licencia ambiental deberá tramitar el respectivo salvoconducto con la autoridad ambiental competente, para el traslado de los parentales, especies, subespecies, razas, hídridos o variedades foráneas desde el puerto de entrada hasta el área en donde se llevará a cabo la fase de investigación o experimental [Laboratorio / Finca / Área de ensayo] y remitir copia del mismo a ésta Autoridad en el primer Informe de Cumplimiento Ambiental - ICA."},{"$f":"'INTRODUCCIÓN ESPECIES FASE INV'!F10","v":"Aplica"},{"$f":"'INTRODUCCIÓN ESPECIES FASE INV'!G10","v":"N/A"},{"$f":"'INTRODUCCIÓN ESPECIES FASE INV'!H10","v":"Permanente"}]
[{"$f":"'INTRODUCCIÓN ESPECIES FASE INV'!D11","v":0},{"$f":"'INTRODUCCIÓN ESPECIES FASE INV'!B11","v":"OBLIGACIÓN GENERAL"},{"$f":"'INTRODUCCIÓN ESPECIES FASE INV'!E11","v":"El titular de la presente licencia ambiental llevará un libro o bitacora con los registros e inventarios respectivos en torno a las diferentes etapas aprobadas en la fase de investigación o experimental, que contengan como mínimo: etapa, lugar, fecha, nombre de los responsables de su manejo, unidades o cantidades de organismos [nombre de la especie introducida] manejada en cada actividad, bioensayos realizados con los organismos, fotografías de los bioensayos y lugares de mantenimiento de los organismos, cantidades de organismos vivos y muertos, fase del ciclo de vida en la que está cada organismo y en la que se produjo su muerte y las evidencias del manejo y disposición final de los mismos. En caso de reprodución, se deberá presentar un inventario de nuevos organismos producidos, entre otros. El libro deberá tener una copia en formato digital y disponible para su consulta en las instalaciones donde tendrá lugar el proyecto en su fase investigación o experimental. Presentar dichos soportes a través de los Informes de Cumplimiento Ambiental - ICA."},{"$f":"'INTRODUCCIÓN ESPECIES FASE INV'!F11","v":"Aplica"},{"$f":"'INTRODUCCIÓN ESPECIES FASE INV'!G11","v":"Aplica"},{"$f":"'INTRODUCCIÓN ESPECIES FASE INV'!H11","v":"Permanente"}]
[{"$f":"'INTRODUCCIÓN ESPECIES FASE INV'!D12","v":0},{"$f":"'INTRODUCCIÓN ESPECIES FASE INV'!B12","v":"OBLIGACIÓN GENERAL"},{"$f":"'INTRODUCCIÓN ESPECIES FASE INV'!E12","v":"El titular de la presente licencia ambiental presentará a través de los Informes de Cumplimiento Ambiental - ICA la  información obtenida a partir de los bioensayos que se realicen durante la fase de investigación o experimental, la cual debe ser analizada con la información proveniente de literatura científica indexada debidamente referenciada."},{"$f":"'INTRODUCCIÓN ESPECIES FASE INV'!F12","v":"N/A"},{"$f":"'INTRODUCCIÓN ESPECIES FASE INV'!G12","v":"Aplica"},{"$f":"'INTRODUCCIÓN ESPECIES FASE INV'!H12","v":"Permanente"}]
[{"$f":"'INTRODUCCIÓN ESPECIES FASE INV'!D13","v":0},{"$f":"'INTRODUCCIÓN ESPECIES FASE INV'!B13","v":"OBLIGACIÓN GENERAL"},{"$f":"'INTRODUCCIÓN ESPECIES FASE INV'!E13","v":"El titular de la presente licencia ambiental presentará a través de los informes de Cumplimiento Ambiental - ICA, el avance del cronograma de la etapa experimental, el cual debe establecer el porcentaje de cumplimiento de las actividades planteadas, así como las dificultades presentadas en caso de retrasos."},{"$f":"'INTRODUCCIÓN ESPECIES FASE INV'!F13","v":"N/A"},{"$f":"'INTRODUCCIÓN ESPECIES FASE INV'!G13","v":"Aplica"},{"$f":"'INTRODUCCIÓN ESPECIES FASE INV'!H13","v":"Permanente"}]
{"$rows_left_out":54}
{"sheet":"Temp","index":3,"n_rows":170,"n_cols":4,"rows_kept":170,"cut":false,"hidden":true,"merged":[[0,0,0,3]]}
["ANEXO - OBLIGACIONES MÍNIMAS PARA [COLOCAR NOMBRE DEL PROYECTO]"]
["COMPONENTE","Fase de construcción","Fase de operación y mantenimiento","Fase de desmantelamiento y abandono"]
[{"$f":"IF('INTRODUCCIÓN ESPECIES FASE INV'!#REF!=\"SI\",'INTRODUCCIÓN ESPECIES FASE INV'!#REF!,NA())","v":{"$error":"#REF!"}},{"$f":"IF('INTRODUCCIÓN ESPECIES FASE INV'!#REF!=\"SI\",'INTRODUCCIÓN ESPECIES FASE INV'!#REF!,NA())","v":{"$error":"#REF!"}},{"$f":"IF('INTRODUCCIÓN ESPECIES FASE INV'!#REF!=\"SI\",'INTRODUCCIÓN ESPECIES FASE INV'!#REF!,NA())","v":{"$error":"#REF!"}},{"$f":"IF('INTRODUCCIÓN ESPECIES FASE INV'!#REF!=\"SI\",'OBLIGACIONES APLICABLES'!#REF!,NA())","v":{"$error":"#REF!"}}]
[{"$f":"IF('INTRODUCCIÓN ESPECIES FASE INV'!#REF!=\"SI\",'INTRODUCCIÓN ESPECIES FASE INV'!#REF!,NA())","v":{"$error":"#REF!"}},{"$f":"IF('INTRODUCCIÓN ESPECIES FASE INV'!#REF!=\"SI\",'INTRODUCCIÓN ESPECIES FASE INV'!#REF!,NA())","v":{"$error":"#REF!"}},{"$f":"IF('INTRODUCCIÓN ESPECIES FASE INV'!#REF!=\"SI\",'OBLIGACIONES APLICABLES'!E40,NA())","v":{"$error":"#REF!"}},{"$f":"IF('INTRODUCCIÓN ESPECIES FASE INV'!#REF!=\"SI\",'OBLIGACIONES APLICABLES'!#REF!,NA())","v":{"$error":"#REF!"}}]
[{"$f":"IF('INTRODUCCIÓN ESPECIES FASE INV'!#REF!=\"SI\",'INTRODUCCIÓN ESPECIES FASE INV'!#REF!,NA())","v":{"$error":"#REF!"}},{"$f":"IF('INTRODUCCIÓN ESPECIES FASE INV'!#REF!=\"SI\",'INTRODUCCIÓN ESPECIES FASE INV'!#REF!,NA())","v":{"$error":"#REF!"}},{"$f":"IF('INTRODUCCIÓN ESPECIES FASE INV'!#REF!=\"SI\",'OBLIGACIONES APLICABLES'!E41,NA())","v":{"$error":"#REF!"}},{"$f":"IF('INTRODUCCIÓN ESPECIES FASE INV'!#REF!=\"SI\",'OBLIGACIONES APLICABLES'!#REF!,NA())","v":{"$error":"#REF!"}}]
[{"$f":"IF('INTRODUCCIÓN ESPECIES FASE INV'!#REF!=\"SI\",'INTRODUCCIÓN ESPECIES FASE INV'!#REF!,NA())","v":{"$error":"#REF!"}},{"$f":"IF('INTRODUCCIÓN ESPECIES FASE INV'!#REF!=\"SI\",'INTRODUCCIÓN ESPECIES FASE INV'!#REF!,NA())","v":{"$error":"#REF!"}},{"$f":"IF('INTRODUCCIÓN ESPECIES FASE INV'!#REF!=\"SI\",'OBLIGACIONES APLICABLES'!#REF!,NA())","v":{"$error":"#REF!"}},{"$f":"IF('INTRODUCCIÓN ESPECIES FASE INV'!#REF!=\"SI\",'OBLIGACIONES APLICABLES'!#REF!,NA())","v":{"$error":"#REF!"}}]
[{"$f":"IF('INTRODUCCIÓN ESPECIES FASE INV'!#REF!=\"SI\",'INTRODUCCIÓN ESPECIES FASE INV'!#REF!,NA())","v":{"$error":"#REF!"}},{"$f":"IF('INTRODUCCIÓN ESPECIES FASE INV'!#REF!=\"SI\",'INTRODUCCIÓN ESPECIES FASE INV'!#REF!,NA())","v":{"$error":"#REF!"}},{"$f":"IF('INTRODUCCIÓN ESPECIES FASE INV'!#REF!=\"SI\",'OBLIGACIONES APLICABLES'!#REF!,NA())","v":{"$error":"#REF!"}},{"$f":"IF('INTRODUCCIÓN ESPECIES FASE INV'!#REF!=\"SI\",'OBLIGACIONES APLICABLES'!#REF!,NA())","v":{"$error":"#REF!"}}]
[{"$f":"IF('INTRODUCCIÓN ESPECIES FASE INV'!#REF!=\"SI\",'INTRODUCCIÓN ESPECIES FASE INV'!#REF!,NA())","v":{"$error":"#REF!"}},{"$f":"IF('INTRODUCCIÓN ESPECIES FASE INV'!#REF!=\"SI\",'INTRODUCCIÓN ESPECIES FASE INV'!#REF!,NA())","v":{"$error":"#REF!"}},{"$f":"IF('INTRODUCCIÓN ESPECIES FASE INV'!#REF!=\"SI\",'OBLIGACIONES APLICABLES'!E42,NA())","v":{"$error":"#REF!"}},{"$f":"IF('INTRODUCCIÓN ESPECIES FASE INV'!#REF!=\"SI\",'OBLIGACIONES APLICABLES'!#REF!,NA())","v":{"$error":"#REF!"}}]
{"$rows_left_out":163}
{"sheet":"Hoja2","index":4,"n_rows":74,"n_cols":4,"rows_kept":74,"cut":false,"hidden":true,"merged":[]}
["COMPONENTE","Fase de construcción","Fase de operación y mantenimiento","Fase de desmantelamiento y abandono"]
[{"$f":"IFERROR(INDEX(Temp!A$3:A$170, SMALL(IF(ISERROR(Temp!A$3:A$170), \"\", ROW(Temp!A$3:A$170)-MIN(ROW(Temp!A$3:A$170))+1), ROW(1:1))),\"\")","v":""},{"$f":"IFERROR(INDEX(Temp!B$3:B$170, SMALL(IF(ISERROR(Temp!B$3:B$170), \"\", ROW(Temp!B$3:B$170)-MIN(ROW(Temp!B$3:B$170))+1), ROW(1:1))),\"\")","v":""},{"$f":"IFERROR(INDEX(Temp!C$3:C$170, SMALL(IF(ISERROR(Temp!C$3:C$170), \"\", ROW(Temp!C$3:C$170)-MIN(ROW(Temp!C$3:C$170))+1), ROW(1:1))),\"\")","v":""},{"$f":"IFERROR(INDEX(Temp!D$3:D$170, SMALL(IF(ISERROR(Temp!D$3:D$170), \"\", ROW(Temp!D$3:D$170)-MIN(ROW(Temp!D$3:D$170))+1), ROW(1:1))),\"\")","v":""}]
[{"$f":"IFERROR(INDEX(Temp!A$3:A$170, SMALL(IF(ISERROR(Temp!A$3:A$170), \"\", ROW(Temp!A$3:A$170)-MIN(ROW(Temp!A$3:A$170))+1), ROW(2:2))),\"\")","v":""},{"$f":"IFERROR(INDEX(Temp!B$3:B$170, SMALL(IF(ISERROR(Temp!B$3:B$170), \"\", ROW(Temp!B$3:B$170)-MIN(ROW(Temp!B$3:B$170))+1), ROW(2:2))),\"\")","v":""},{"$f":"IFERROR(INDEX(Temp!C$3:C$170, SMALL(IF(ISERROR(Temp!C$3:C$170), \"\", ROW(Temp!C$3:C$170)-MIN(ROW(Temp!C$3:C$170))+1), ROW(2:2))),\"\")","v":""},{"$f":"IFERROR(INDEX(Temp!D$3:D$170, SMALL(IF(ISERROR(Temp!D$3:D$170), \"\", ROW(Temp!D$3:D$170)-MIN(ROW(Temp!D$3:D$170))+1), ROW(2:2))),\"\")","v":""}]
[{"$f":"IFERROR(INDEX(Temp!A$3:A$170, SMALL(IF(ISERROR(Temp!A$3:A$170), \"\", ROW(Temp!A$3:A$170)-MIN(ROW(Temp!A$3:A$170))+1), ROW(3:3))),\"\")","v":""},{"$f":"IFERROR(INDEX(Temp!B$3:B$170, SMALL(IF(ISERROR(Temp!B$3:B$170), \"\", ROW(Temp!B$3:B$170)-MIN(ROW(Temp!B$3:B$170))+1), ROW(3:3))),\"\")","v":""},{"$f":"IFERROR(INDEX(Temp!C$3:C$170, SMALL(IF(ISERROR(Temp!C$3:C$170), \"\", ROW(Temp!C$3:C$170)-MIN(ROW(Temp!C$3:C$170))+1), ROW(3:3))),\"\")","v":""},{"$f":"IFERROR(INDEX(Temp!D$3:D$170, SMALL(IF(ISERROR(Temp!D$3:D$170), \"\", ROW(Temp!D$3:D$170)-MIN(ROW(Temp!D$3:D$170))+1), ROW(3:3))),\"\")","v":""}]
[{"$f":"IFERROR(INDEX(Temp!A$3:A$170, SMALL(IF(ISERROR(Temp!A$3:A$170), \"\", ROW(Temp!A$3:A$170)-MIN(ROW(Temp!A$3:A$170))+1), ROW(4:4))),\"\")","v":""},{"$f":"IFERROR(INDEX(Temp!B$3:B$170, SMALL(IF(ISERROR(Temp!B$3:B$170), \"\", ROW(Temp!B$3:B$170)-MIN(ROW(Temp!B$3:B$170))+1), ROW(4:4))),\"\")","v":""},{"$f":"IFERROR(INDEX(Temp!C$3:C$170, SMALL(IF(ISERROR(Temp!C$3:C$170), \"\", ROW(Temp!C$3:C$170)-MIN(ROW(Temp!C$3:C$170))+1), ROW(4:4))),\"\")","v":""},{"$f":"IFERROR(INDEX(Temp!D$3:D$170, SMALL(IF(ISERROR(Temp!D$3:D$170), \"\", ROW(Temp!D$3:D$170)-MIN(ROW(Temp!D$3:D$170))+1), ROW(4:4))),\"\")","v":""}]
[{"$f":"IFERROR(INDEX(Temp!A$3:A$170, SMALL(IF(ISERROR(Temp!A$3:A$170), \"\", ROW(Temp!A$3:A$170)-MIN(ROW(Temp!A$3:A$170))+1), ROW(5:5))),\"\")","v":""},{"$f":"IFERROR(INDEX(Temp!B$3:B$170, SMALL(IF(ISERROR(Temp!B$3:B$170), \"\", ROW(Temp!B$3:B$170)-MIN(ROW(Temp!B$3:B$170))+1), ROW(5:5))),\"\")","v":""},{"$f":"IFERROR(INDEX(Temp!C$3:C$170, SMALL(IF(ISERROR(Temp!C$3:C$170), \"\", ROW(Temp!C$3:C$170)-MIN(ROW(Temp!C$3:C$170))+1), ROW(5:5))),\"\")","v":""},{"$f":"IFERROR(INDEX(Temp!D$3:D$170, SMALL(IF(ISERROR(Temp!D$3:D$170), \"\", ROW(Temp!D$3:D$170)-MIN(ROW(Temp!D$3:D$170))+1), ROW(5:5))),\"\")","v":""}]
[{"$f":"IFERROR(INDEX(Temp!A$3:A$170, SMALL(IF(ISERROR(Temp!A$3:A$170), \"\", ROW(Temp!A$3:A$170)-MIN(ROW(Temp!A$3:A$170))+1), ROW(6:6))),\"\")","v":""},{"$f":"IFERROR(INDEX(Temp!B$3:B$170, SMALL(IF(ISERROR(Temp!B$3:B$170), \"\", ROW(Temp!B$3:B$170)-MIN(ROW(Temp!B$3:B$170))+1), ROW(6:6))),\"\")","v":""},{"$f":"IFERROR(INDEX(Temp!C$3:C$170, SMALL(IF(ISERROR(Temp!C$3:C$170), \"\", ROW(Temp!C$3:C$170)-MIN(ROW(Temp!C$3:C$170))+1), ROW(6:6))),\"\")","v":""},{"$f":"IFERROR(INDEX(Temp!D$3:D$170, SMALL(IF(ISERROR(Temp!D$3:D$170), \"\", ROW(Temp!D$3:D$170)-MIN(ROW(Temp!D$3:D$170))+1), ROW(6:6))),\"\")","v":""}]
[{"$f":"IFERROR(INDEX(Temp!A$3:A$170, SMALL(IF(ISERROR(Temp!A$3:A$170), \"\", ROW(Temp!A$3:A$170)-MIN(ROW(Temp!A$3:A$170))+1), ROW(7:7))),\"\")","v":""},{"$f":"IFERROR(INDEX(Temp!B$3:B$170, SMALL(IF(ISERROR(Temp!B$3:B$170), \"\", ROW(Temp!B$3:B$170)-MIN(ROW(Temp!B$3:B$170))+1), ROW(7:7))),\"\")","v":""},{"$f":"IFERROR(INDEX(Temp!C$3:C$170, SMALL(IF(ISERROR(Temp!C$3:C$170), \"\", ROW(Temp!C$3:C$170)-MIN(ROW(Temp!C$3:C$170))+1), ROW(7:7))),\"\")","v":""},{"$f":"IFERROR(INDEX(Temp!D$3:D$170, SMALL(IF(ISERROR(Temp!D$3:D$170), \"\", ROW(Temp!D$3:D$170)-MIN(ROW(Temp!D$3:D$170))+1), ROW(7:7))),\"\")","v":""}]
{"$rows_left_out":66}