{"text_format":"1","workbook":"xlsx","n_sheets":6,"sheets":["INSTRUCTIVO DE USO","DRAGADOS","OBLIGACIONES APLICABLES","Asuntos radicación","Temp","Hoja2"],"not_rendered":{"charts":0,"images":2,"macros":1,"external_links":0,"defined_names":3,"comments":1,"pivot_tables":0},"unopened":[],"bounds":{"document_bytes":16777216,"sheet_cells":100000,"rows_first":2000,"rows_last":500,"rows_between":2000,"halvings":0,"cell_chars":16384,"cell_head_chars":4096},"cells_cut":0,"cells_raw":0,"read":"whole","date_system":"1900"}

{"sheet":"INSTRUCTIVO DE USO","index":0,"n_rows":11,"n_cols":3,"rows_kept":11,"cut":false,"hidden":true,"merged":[[10,0,10,12],[0,0,0,1],[0,2,0,12],[2,0,2,12],[4,0,5,12],[7,0,8,12]]}
[null,null,"INSTRUCTIVO DE USO DEL INSTRUMENTO DE OBLIGACIONES MÍNIMAS "]
[]
["1. INTRODUCCIÓN\n\nLas Obligaciones Mínimas son un instrumento interno de la Autoridad Nacional de Licencias Ambientales – ANLA formulado con el fin de unificar criterios por parte de los profesionales que realizan la evaluación y seguimiento de proyectos, obras o actividades sujetos al trámite de licenciamiento ambiental, mediante la estandarización de obligaciones mínimas asociadas al acto administrativo a través del cual se otorga o modifica la licencia ambiental, se actualizan los planes de manejo ambiental y se imponen medidas adicionales, de tal manera que se asegure que en cada tipo de proyecto se impongan las mismas obligaciones estandarizadas bajo requerimientos legales y directrices institucionales, así como con condiciones unificadas y claramente definidas de modo, tiempo y lugar.\n\nEs importante resaltar que, este instrumento al ser interno facilita la labor de esta autoridad en la imposición de obligaciones mínimas en los procesos de evaluación y seguimiento (este último en los casos estrictamente aplicables), y en la verificación del cumplimiento de las mismas en el seguimiento. Sin embargo, al ser puesto a disposición de los usuarios o solicitantes de licencias ambientales servirá como herramienta de planeación de los proyectos, obras o actividades sujetos a licenciamiento, de tal manera que previo a la radicación de los estudios ambientales frente a esta autoridad, las obligaciones puedan ser incorporadas por los usuarios en la formulación de los Planes de Manejo Ambiental - PMA\n\nPor lo anterior, a continuación se realizan algunas precisiones a los solicitantes de licencias ambientales cuando estos deseen consultar y hacer uso de este instrumento durante el proceso de formulación de sus PMA."]
[]
["2. DEFINICIONES\n\nCondición de lugar: (dónde) lugares o puntos en los que debe desarrollarse la actividad según experticia del evaluador o según protocolos, guías, normativa en general, etc.\nCondición de modo: (cómo) descripción de las características o circunstancias en las que se deben realizar las actividades autorizadas, según protocolos, guías, normativa en general y aspectos administrativos que se definan.\nCondición de tiempo: (cuándo) periodicidad para la ejecución de monitoreos, tiempos de realización de actividades, tiempos de presentación de la información, etc.\nObligaciones mínimas: Describen las condiciones mínimas de modo, tiempo y lugar a través de las cuales la Autoridad Ambiental, autoriza la ejecución de un proyecto, obra o actividad sujeto legalmente al trámite de Licenciamiento Ambiental, identificando los permisos, autorizaciones y/o concesiones cuando sea el caso, de conformidad con cada subsector (tipo de proyecto). En razón a lo anterior, se clasifican las obligaciones mínimas, de conformidad con las características de las condiciones reglamentadas, de la siguiente manera: obligaciones de uso, aprovechamiento y/o afectación de recursos naturales, obligaciones asociadas a componentes y actividades, obligaciones asociadas a planes, obligaciones socioeconómicas, obligaciones generales y requisitos del acto administrativo. \nObligaciones de uso, aprovechamiento y/o afectación de recursos naturales: están relacionadas con las autorizaciones y/o permisos otorgados para el uso, aprovechamiento y/o afectación de los recursos naturales, tales como: emisiones atmosféricas, ruido, aprovechamiento forestal, concesión aguas subterráneas, exploración de aguas subterráneas, concesión aguas superficiales, ocupación de cauce, vertimiento en agua superficial, vertimiento en suelo, entre otras.\nObligaciones asociadas a componentes y actividades: contiene obligaciones relacionadas con algunos componentes y actividades propias del proyecto, obra o actividad, tales como: adecuación / construcción de vías existentes de apoyo al proyecto, almacenamiento de materiales de construcción, almacenamiento de combustibles y productos químicos, compra de agua, recirculación de agua residual, entrega de aguas residuales para reúso, entrega de aguas residuales a terceros, materiales de construcción, gestión de residuos, zonas de disposición de material sobrante de excavaciones, entre otras.\nObligaciones asociadas a Planes: contiene obligaciones relacionadas con la ejecución y cumplimiento de algunos planes definidos en la licencia ambiental de un proyecto, tales como: plan de compensación del medio biótico, plan de gestión del riesgo, plan de desmantelamiento y abandono y plan de inversión de no menos del 1%.\nObligaciones socioeconómicas: contienen obligaciones relacionadas con temas, tales como: gestión social y valoración económica.\nObligaciones generales: agrupa diferentes aspectos relacionados con cumplimiento de parámetros normativos, presentación de Informes de Cumplimiento Ambiental – ICA, notificaciones de cambios menores, solicitudes de modificación de licencia ambiental y demás condiciones generales a ser tenidas en cuenta por parte del titular de la licencia. La inclusión por parte de los profesionales jurídicos de este tipo de obligaciones, deberá realizarse en todas las licencias ambientales, sin importar el tipo de proyecto. En caso de que el solicitante de la licencia ambiental haga uso de este instrumento durante el proceso de formulación de su PMA, no deberá tener en cuenta este tipo de obligaciones dada la naturaleza de las mismas.\nRequisitos del acto administrativo: corresponde a aquellas obligaciones de la ANLA frente a cada licencia ambiental. La inclusión por parte de los profesionales jurídicos de este tipo de obligaciones deberá realizarse en todas las licencias ambientales, sin importar el tipo de proyecto. No tienen relación alguna con las fases de desarrollo del proyecto y no son objeto de seguimiento. Algunas de las obligaciones, contienen textos en rojo que deberán ser diligenciados directamente en el acto administrativo por el profesional jurídico, como: nombre y NIT del titular del proyecto. En caso de que el solicitante de la licencia ambiental haga uso de este instrumento durante el proceso de formulación de su PMA, no deberá tenerl en cuenta este tipo de obligaciones dada la naturaleza de las mismas."]
[]
{"$rows_left_out":6}
{"sheet":"DRAGADOS","index":1,"n_rows":116,"n_cols":10,"rows_kept":116,"cut":false,"hidden":false,"merged":[[0,0,4,1],[0,2,4,4],[0,5,1,5],[0,6,1,9],[2,5,3,5],[2,6,3,9],[4,6,4,9],[10,9,11,9],[5,0,5,4],[5,5,5,8],[10,0,11,0],[10,1,11,1],[10,2,11,2],[10,4,11,4],[10,5,11,5],[10,6,11,6],[10,7,11,7],[10,8,11,8],[34,6,35,6],[34,7,35,7],[34,8,35,8],[34,9,35,9],[34,0,35,0],[34,1,35,1],[34,2,35,2],[34,4,35,4],[34,5,35,5]]}
[null,null,"OBLIGACIONES MÍNIMAS DRAGADOS\nRecuerde completar los textos en rojo directamente en el CTE.\nNOTA: Dar doble clic en cada celda de la columna Aplica para indicar si la obligación será impuesta R o no T",null,null,"Fecha:","31-08-2023"]
[]
[null,null,null,null,null,"Versión:",1]
[]
[null,null,null,null,null,"Código:","EL-FO-64"]
["SECCIÓN 1. PERMISOS, AUTORIZACIONES Y ASPECTOS GENERALES",null,null,null,null,"SECCIÓN 2. FASE DEL PROYECTO PARA EL CUMPLIMIENTO Y SEGUIMIENTO A OBLIGACIONES",null,null,null,"SECCIÓN 3. TEMPORALIDAD"]
{"$rows_left_out":111}
{"sheet":"OBLIGACIONES APLICABLES","index":2,"n_rows":111,"n_cols":8,"rows_kept":111,"cut":false,"hidden":false,"merged":[[0,1,0,7],[5,2,6,2],[5,1,6,1],[5,3,6,3],[5,4,6,4],[5,5,6,5],[5,6,6,6],[5,7,6,7],[29,6,30,6],[29,7,30,7],[29,1,30,1],[29,2,30,2],[29,3,30,3],[29,4,30,4],[29,5,30,5]]}
[null,"OBLIGACIONES MÍNIMAS APLICABLES AL PROYECTO, OBRA O ACTIVIDAD EN EVALUACIÓN / SEGUIMIENTO\nNota: Dar clic en el botón de Actualizar Anexo y usar el texto de esta hoja para construir el concepto técnico y acto administrativo (Copiar y pegar en cada documento a construir)"]
["Aplica (si / no)","TEMÁTICA","OBLIGACIÓN ESTANDARIZADA","Pre construcción","Construcción","Operación y mantenimiento","Desmantelamiento y abandono","Temporalidad"]
[{"$f":"DRAGADOS!D8","v":0},{"$f":"DRAGADOS!B8","v":"AIRE"},{"$f":"DRAGADOS!E8","v":"Realizar monitoreos de calidad del aire con los criterios establecidos para un (Sistema de Vigilancia de Calidad de Aire Industrial Fijo / Indicativo - SVCAI. Seleccionar el sistema de acuerdo con la complejidad del proyecto) según el Protocolo para el Monitoreo y Seguimiento de la Calidad del Aire del MAVDT del 2010 (adoptado por la Resolución 650 de 2010, y ajustado por la Resolución 2154 de 2010, o la norma que la modifique, derogue o sustituya), y entregar los respectivos soportes en los Informes de Cumplimiento Ambiental - ICA, teniendo en cuenta lo siguiente:\n\na) Documento donde se argumente la selección de la localización de las estaciones que conformen el Sistema de Vigilancia de Calidad de Aire, teniendo en cuenta los criterios establecidos en el Protocolo para el Monitoreo y Seguimiento de la Calidad del Aire del MAVDT (2010). Esta obligación se presentará en el primer Informe de Cumplimiento Ambiental - ICA.\nb) Información meteorológica: debe hacer referencia al año calendario inmediatamente anterior al estudio, la cual debe ser previamente validada de acuerdo a los estándares establecidos por la EPA, de igual forma se deberá entregar la información meteorológica de la campaña de monitoreo (Quality Assurance Handbook for Air Pollution Measurement Systems Volumen IV: Meteorological Measurement Versión 2.0 EPA-454/B-08-002). Anexar los archivos georreferenciados de acuerdo con el modelo de almacenamiento geográfico establecido en la Resolución 2182 de 2016 del MADS, o la que la modifique, derogue o sustituya.\nc) Reportes de laboratorio (que incluya datos diarios u horarios dependiendo de la tecnología de la estación de monitoreo - manual o automática).\nd) Comparación de las mediciones con los niveles máximos permisibles establecidos en la Resolución 2254 de 2017 del MADS, o aquella que la modifique, derogue o sustituya, y con la línea base presentada en el EIA para los contaminantes evaluados. Los contaminantes a registrar serán los establecidos en la Resolución  2254 de 2017 del MADS, o aquella que la modifique o sustituya, aplicables según la actividad industrial desarrollada y las fuentes de emisión identificadas. \ne) Informe de las acciones implementadas para garantizar el cumplimiento de los estándares en caso de sobrepasar los límites de inmisión para cada contaminante.\nf) Informe que incluya como mínimo los contenidos establecidos en el Protocolo para el Monitoreo y Seguimiento de la Calidad del Aire del MAVDT (2010) - Manual de operación, según el sistema de vigilancia de calidad del aire aplicable."},{"$f":"DRAGADOS!F8","v":"N/A"},{"$f":"DRAGADOS!G8","v":"Aplica"},{"$f":"DRAGADOS!H8","v":"N/A"},{"$f":"DRAGADOS!I8","v":"N/A"},{"$f":"DRAGADOS!J8","v":"Permanente"}]
[{"$f":"DRAGADOS!D9","v":0},{"$f":"DRAGADOS!B9","v":"AIRE"},{"$f":"DRAGADOS!E9","v":"Presentar en el primer Informe de Cumplimiento Ambiental - ICA de la fase constructiva / antes del inicio de las actividades de construcción (seleccionar momento de entrega del plan de acuerdo con la duración del proyecto) el plan de riego asociado a la humectación de vías de acceso y zonas descubiertas sin pavimentar (internas del proyecto), el cual debe incluir lo siguiente:\n\na) Rutas y zonas por regar. \nb) Métodos de riego empleados, los cuales deberán garantizar la mayor área de humectación y el menor consumo de agua. \nc) Agua a emplear en las actividades de humectación, la cual deberá dar cumplimiento a lo establecido en la normatividad vigente, y las obligaciones establecidas sobre (Espacio para indicar los permisos/autorizaciones respectivas que se hayan autorizado al proyecto y que estén relacionados con el agua que será empleada para la humectación de vías: vertimientos al suelo, concesión de aguas, compra de agua, aguas lluvias, recirculación en suelo soporte de infraestructura, entre otras).\nd) En caso de emplear aditivos u otros materiales, deberán ser inocuos y no presentar problemas de compactación u otros impactos al suelo superficial, por infiltración o escorrentía ante eventuales precipitaciones. \ne) Indicadores asociados con las actividades de humectación en función del área regada, las cantidades de agua empleadas y la cantidad de material particulado mitigado."},{"$f":"DRAGADOS!F9","v":"Aplica"},{"$f":"DRAGADOS!G9","v":"Aplica"},{"$f":"DRAGADOS!H9","v":"N/A"},{"$f":"DRAGADOS!I9","v":"N/A"},{"$f":"DRAGADOS!J9","v":"Temporal"}]
[{"$f":"DRAGADOS!D10","v":0},{"$f":"DRAGADOS!B10","v":"AIRE"},{"$f":"DRAGADOS!E10","v":"Presentar los soportes de implementación del plan de riego en vías en los respectivos Informes de Cumplimiento Ambiental - ICA, incluyendo: i) evidencias de la ejecución de las medidas con los volúmenes de agua empleados, su origen, métodos de riego empleados, áreas y vías en las cuales fue realizado y ii) análisis de la información meteorológica para el balance hídrico de evaporación-precipitación en los periodos de riego."},{"$f":"DRAGADOS!F10","v":"N/A"},{"$f":"DRAGADOS!G10","v":"Aplica"},{"$f":"DRAGADOS!H10","v":"N/A"},{"$f":"DRAGADOS!I10","v":"N/A"},{"$f":"DRAGADOS!J10","v":"Permanente"}]
[{"$f":"DRAGADOS!D11","v":0},{"$f":"DRAGADOS!B11","v":"CAMBIO CLIMÁTICO"},{"$f":"DRAGADOS!E11","v":"Presentar el Plan Integral de Gestión de Cambio Climático del proyecto (PIGCCp) y los anexos correspondientes en el Informe de Cumplimiento Ambiental – ICA, a (los seis meses, al año, etc., definir la frecuencia teniendo en cuenta la duración del proyecto) de la ejecutoria del acto administrativo que acoja esta obligación / antes del inicio de las actividades de construcción (ajustar según aplique para otorgamiento de licencia, modificación de licencia o ajuste vía seguimiento),  el cual contendrá como mínimo lo siguiente: \n\n1. Objetivos y metas orientados a establecer las acciones de gestión al cambio climático. \n2. La metodología seleccionada para las estimaciones de emisiones y/o remociones GEI del proyecto teniendo en cuenta los criterios que defina el Ministerio de Ambiente y Desarrollo Sostenible (MinAmbiente) y, en caso de que no estén establecidos los criterios metodológicos del inventario GEI por el MinAmbiente, se deberá presentar la metodología o modelo de cuantificación acorde con la Norma Técnica Colombiana NTC-ISO 14064-1 en su versión más reciente o del estándar de reporte de inventario GEI que la Sociedad considere acorde para el proyecto, justificando la selección del estándar y describiendo la metodología o modelo de cuantificación. \n3. La cuantificación del inventario de las emisiones y remociones directas e indirectas de gases efecto invernadero (GEI), teniendo en cuenta:\n\na) Las sustancias dióxido de carbono (CO2), óxido nitroso (N2O), metano (CH4), hidrofluorocarbonos (HFC), perfluorocarbonos (PFC), Trifluoruro de nitrógeno (NF3) y Hexafluoruro de Azufre (SF6), u otras sustancias con potencial de calentamiento global que sean identificadas, en toneladas de CO2eq.\nb) El informe del inventario contemplando los criterios que defina el Ministerio de Ambiente y Desarrollo Sostenible (MinAmbiente), la Norma Técnica Colombiana NTC-ISO 14064-1 en su versión más reciente o el estándar de reporte de inventario GEI que el titular del instrumento de manejo y control ambiental haya seleccionado. \nc) En caso de que por la naturaleza del proyecto no se requiera de la estimación de alguna(s) de las sustancias, alcances o categorías de acuerdo con el estándar del inventario seleccionado, justificar técnicamente. \nd) Los resultados del inventario en hoja de cálculo (Excel editable), junto con su respectivo análisis, la cual deberá contemplar como mínimo: puntos de emisión ID, alcance o categoría según el estándar del inventario seleccionado, tipo de fuente generadora GEI, nombre fuente de emisión GEI, características de la fuente de GEI, categoría IPCC equivalente, Nombre de la sustancia, método de determinación de la emisión, emisión (carga emitida) determinada (kg/año), potencial de calentamiento global, emisión (tonelada de CO2e/año), fuentes de información de los datos empleados y trazabilidad de los cálculos realizados y tipo de verificación GEI (primera, segunda o tercera parte).\n\n4. Las acciones de mitigación y estimado de reducción de GEI proyectadas en el tiempo de vida útil del proyecto autorizado, en hoja de cálculo (Excel editable), contemplando como mínimo: Nombre de la medida, objetivo, descripción de la medida y acciones a seguir, potencial de mitigación de la medida (toneladas de CO2 eq), indicador propuesto, fuentes de información de los datos empleados y trazabilidad de los cálculos realizados, fecha de inicio y fin de implementación. \n5. Las acciones de mitigación de GEI deberán contar con indicadores cuantitativos y cualitativos, de cumplimiento, eficacia y efectividad, que contengan como mínimo lo siguiente: nombre de cada indicador, unidad de medida, frecuencia de medición o de cálculo, definición, fórmula y metodología de medición o cálculo, describiendo los procedimientos utilizados para la medición y relacionando los instrumentos necesarios, fuentes de información de las variables que requiere, responsable de la medición o cálculo (sección, dependencia o persona) y criterios para el análisis e interpretación de resultados. Estos indicadores se presentarán para cada etapa del proyecto de acuerdo con el tiempo de vida útil del proyecto autorizado.\n8. Cronograma y localización de la aplicación de las acciones de gestión de cambio climático. "},{"$f":"DRAGADOS!F11","v":"Aplica"},{"$f":"DRAGADOS!G11","v":"Aplica"},{"$f":"DRAGADOS!H11","v":"N/A"},{"$f":"DRAGADOS!I11","v":"N/A"},{"$f":"DRAGADOS!J11","v":"Temporal"}]
{"$rows_left_out":106}
{"sheet":"Asuntos radicación","index":3,"n_rows":63,"n_cols":5,"rows_kept":63,"cut":false,"hidden":false,"merged":[[0,1,0,4],[25,1,27,1],[28,1,29,1],[31,1,32,1],[34,1,38,1],[7,4,9,4],[39,1,47,1],[54,1,55,1],[4,1,5,1],[7,1,9,1],[7,3,9,3],[20,1,21,1],[22,1,23,1]]}
[null,"Asuntos de radicación relacionados con la Obligación General \"Estrategia de recepción de información de los resultados de los monitoreos del uso y aprovechamiento de los recursos naturales\":"]
[]
[null,"ASPECTO","TIPO","ABREVIATURA","ASUNTO"]
[null,"OCUPACION DE CAUCE","NA","OCA",{"$f":"D4&\"-LAM/LAVXXXX-XX-XXXX\"","v":"OCA-LAM/LAVXXXX-XX-XXXX"}]
[null,"CAPTACIÓN","SUPERFICIAL","CSP",{"$f":"D5&\"-LAM/LAVXXXX-XX-XXXX\"","v":"CSP-LAM/LAVXXXX-XX-XXXX"}]
[null,null,"SUBTERRANEA","CSB","CSB-LAM/LAVXXXX-XX-XXXX"]
{"$rows_left_out":58}
{"sheet":"Temp","index":4,"n_rows":170,"n_cols":4,"rows_kept":170,"cut":false,"hidden":true,"merged":[[0,0,0,3]]}
["ANEXO - OBLIGACIONES MÍNIMAS PARA [COLOCAR NOMBRE DEL PROYECTO]"]
["COMPONENTE","Fase de construcción","Fase de operación y mantenimiento","Fase de desmantelamiento y abandono"]
[{"$f":"IF(#REF!=\"SI\",#REF!,NA())","v":{"$error":"#REF!"}},{"$f":"IF(#REF!=\"SI\",#REF!,NA())","v":{"$error":"#REF!"}},{"$f":"IF(#REF!=\"SI\",#REF!,NA())","v":{"$error":"#REF!"}},{"$f":"IF(#REF!=\"SI\",'OBLIGACIONES APLICABLES'!G3,NA())","v":{"$error":"#REF!"}}]
[{"$f":"IF(#REF!=\"SI\",#REF!,NA())","v":{"$error":"#REF!"}},{"$f":"IF(#REF!=\"SI\",#REF!,NA())","v":{"$error":"#REF!"}},{"$f":"IF(#REF!=\"SI\",'OBLIGACIONES APLICABLES'!F4,NA())","v":{"$error":"#REF!"}},{"$f":"IF(#REF!=\"SI\",'OBLIGACIONES APLICABLES'!G4,NA())","v":{"$error":"#REF!"}}]
[{"$f":"IF(#REF!=\"SI\",#REF!,NA())","v":{"$error":"#REF!"}},{"$f":"IF(#REF!=\"SI\",#REF!,NA())","v":{"$error":"#REF!"}},{"$f":"IF(#REF!=\"SI\",'OBLIGACIONES APLICABLES'!F5,NA())","v":{"$error":"#REF!"}},{"$f":"IF(#REF!=\"SI\",'OBLIGACIONES APLICABLES'!G5,NA())","v":{"$error":"#REF!"}}]
[{"$f":"IF(#REF!=\"SI\",#REF!,NA())","v":{"$error":"#REF!"}},{"$f":"IF(#REF!=\"SI\",#REF!,NA())","v":{"$error":"#REF!"}},{"$f":"IF(#REF!=\"SI\",'OBLIGACIONES APLICABLES'!#REF!,NA())","v":{"$error":"#REF!"}},{"$f":"IF(#REF!=\"SI\",'OBLIGACIONES APLICABLES'!#REF!,NA())","v":{"$error":"#REF!"}}]
{"$rows_left_out":165}
{"sheet":"Hoja2","index":5,"n_rows":74,"n_cols":4,"rows_kept":74,"cut":false,"hidden":true,"merged":[]}
["COMPONENTE","Fase de construcción","Fase de operación y mantenimiento","Fase de desmantelamiento y abandono"]
[{"$f":"IFERROR(INDEX(Temp!A$3:A$170, SMALL(IF(ISERROR(Temp!A$3:A$170), \"\", ROW(Temp!A$3:A$170)-MIN(ROW(Temp!A$3:A$170))+1), ROW(1:1))),\"\")","v":""},{"$f":"IFERROR(INDEX(Temp!B$3:B$170, SMALL(IF(ISERROR(Temp!B$3:B$170), \"\", ROW(Temp!B$3:B$170)-MIN(ROW(Temp!B$3:B$170))+1), ROW(1:1))),\"\")","v":""},{"$f":"IFERROR(INDEX(Temp!C$3:C$170, SMALL(IF(ISERROR(Temp!C$3:C$170), \"\", ROW(Temp!C$3:C$170)-MIN(ROW(Temp!C$3:C$170))+1), ROW(1:1))),\"\")","v":""},{"$f":"IFERROR(INDEX(Temp!D$3:D$170, SMALL(IF(ISERROR(Temp!D$3:D$170), \"\", ROW(Temp!D$3:D$170)-MIN(ROW(Temp!D$3:D$170))+1), ROW(1:1))),\"\")","v":""}]
[{"$f":"IFERROR(INDEX(Temp!A$3:A$170, SMALL(IF(ISERROR(Temp!A$3:A$170), \"\", ROW(Temp!A$3:A$170)-MIN(ROW(Temp!A$3:A$170))+1), ROW(2:2))),\"\")","v":""},{"$f":"IFERROR(INDEX(Temp!B$3:B$170, SMALL(IF(ISERROR(Temp!B$3:B$170), \"\", ROW(Temp!B$3:B$170)-MIN(ROW(Temp!B$3:B$170))+1), ROW(2:2))),\"\")","v":""},{"$f":"IFERROR(INDEX(Temp!C$3:C$170, SMALL(IF(ISERROR(Temp!C$3:C$170), \"\", ROW(Temp!C$3:C$170)-MIN(ROW(Temp!C$3:C$170))+1), ROW(2:2))),\"\")","v":""},{"$f":"IFERROR(INDEX(Temp!D$3:D$170, SMALL(IF(ISERROR(Temp!D$3:D$170), \"\", ROW(Temp!D$3:D$170)-MIN(ROW(Temp!D$3:D$170))+1), ROW(2:2))),\"\")","v":""}]
[{"$f":"IFERROR(INDEX(Temp!A$3:A$170, SMALL(IF(ISERROR(Temp!A$3:A$170), \"\", ROW(Temp!A$3:A$170)-MIN(ROW(Temp!A$3:A$170))+1), ROW(3:3))),\"\")","v":""},{"$f":"IFERROR(INDEX(Temp!B$3:B$170, SMALL(IF(ISERROR(Temp!B$3:B$170), \"\", ROW(Temp!B$3:B$170)-MIN(ROW(Temp!B$3:B$170))+1), ROW(3:3))),\"\")","v":""},{"$f":"IFERROR(INDEX(Temp!C$3:C$170, SMALL(IF(ISERROR(Temp!C$3:C$170), \"\", ROW(Temp!C$3:C$170)-MIN(ROW(Temp!C$3:C$170))+1), ROW(3:3))),\"\")","v":""},{"$f":"IFERROR(INDEX(Temp!D$3:D$170, SMALL(IF(ISERROR(Temp!D$3:D$170), \"\", ROW(Temp!D$3:D$170)-MIN(ROW(Temp!D$3:D$170))+1), ROW(3:3))),\"\")","v":""}]
[{"$f":"IFERROR(INDEX(Temp!A$3:A$170, SMALL(IF(ISERROR(Temp!A$3:A$170), \"\", ROW(Temp!A$3:A$170)-MIN(ROW(Temp!A$3:A$170))+1), ROW(4:4))),\"\")","v":""},{"$f":"IFERROR(INDEX(Temp!B$3:B$170, SMALL(IF(ISERROR(Temp!B$3:B$170), \"\", ROW(Temp!B$3:B$170)-MIN(ROW(Temp!B$3:B$170))+1), ROW(4:4))),\"\")","v":""},{"$f":"IFERROR(INDEX(Temp!C$3:C$170, SMALL(IF(ISERROR(Temp!C$3:C$170), \"\", ROW(Temp!C$3:C$170)-MIN(ROW(Temp!C$3:C$170))+1), ROW(4:4))),\"\")","v":""},{"$f":"IFERROR(INDEX(Temp!D$3:D$170, SMALL(IF(ISERROR(Temp!D$3:D$170), \"\", ROW(Temp!D$3:D$170)-MIN(ROW(Temp!D$3:D$170))+1), ROW(4:4))),\"\")","v":""}]
[{"$f":"IFERROR(INDEX(Temp!A$3:A$170, SMALL(IF(ISERROR(Temp!A$3:A$170), \"\", ROW(Temp!A$3:A$170)-MIN(ROW(Temp!A$3:A$170))+1), ROW(5:5))),\"\")","v":""},{"$f":"IFERROR(INDEX(Temp!B$3:B$170, SMALL(IF(ISERROR(Temp!B$3:B$170), \"\", ROW(Temp!B$3:B$170)-MIN(ROW(Temp!B$3:B$170))+1), ROW(5:5))),\"\")","v":""},{"$f":"IFERROR(INDEX(Temp!C$3:C$170, SMALL(IF(ISERROR(Temp!C$3:C$170), \"\", ROW(Temp!C$3:C$170)-MIN(ROW(Temp!C$3:C$170))+1), ROW(5:5))),\"\")","v":""},{"$f":"IFERROR(INDEX(Temp!D$3:D$170, SMALL(IF(ISERROR(Temp!D$3:D$170), \"\", ROW(Temp!D$3:D$170)-MIN(ROW(Temp!D$3:D$170))+1), ROW(5:5))),\"\")","v":""}]
{"$rows_left_out":68}